{"text_format":"1","workbook":"xlsx","n_sheets":8,"sheets":["Instructions","Template","Definitions","From File","database","codes","dbf","1304"],"not_rendered":{"charts":0,"images":3,"macros":1,"external_links":0,"defined_names":27,"comments":0,"pivot_tables":0},"unopened":[],"bounds":{"document_bytes":16777216,"sheet_cells":100000,"rows_first":2000,"rows_last":500,"rows_between":2000,"halvings":0,"cell_chars":16384,"cell_head_chars":4096},"cells_cut":0,"cells_raw":0,"read":"whole","date_system":"1900"}

{"sheet":"Instructions","index":0,"n_rows":0,"n_cols":0,"rows_kept":0,"cut":false,"hidden":false,"merged":[]}

{"sheet":"Template","index":1,"n_rows":193,"n_cols":63,"rows_kept":193,"cut":false,"hidden":false,"merged":[[13,0,13,2],[23,0,23,2],[0,0,0,2],[45,0,45,1]]}
["Monthly Statement of Earnings and Expenses of Foreign Shipping Companies",null,null,"Appendix V-35",null,null,null,null,null,null,null,null,null,null,null,null,null,null,null,null,null,null,null,null,null,null,null,null,null,null,null,null,null,null,null,null,null,null,null,null,null,null,null,null,null,null,null,null,null,null,null,null,null,null,null,null,null,null,null,null,null,null,"Reporting Period"]
["Foreign Shipping Company/ Agent Code",null,null,{"$f":"IF(C2=\"\",VLOOKUP(B3,codes!$D$1:$E$5029,2,FALSE),C2)","v":{"$error":"#N/A"}},null,null,null,null,null,null,null,null,null,null,null,null,null,null,null,null,null,null,null,null,null,null,null,null,null,null,null,null,null,null,null,null,null,null,null,null,null,null,null,null,null,null,null,null,null,null,null,null,null,null,null,null,null,null,null,null,null,null,"2015-01-31"]
["Name of Foreign Shipping Company/ Agent","","   ",{"$f":"INDEX(codes!D:D,MATCH(D2,codes!E:E,0))","v":{"$error":"#N/A"}},null,null,null,null,null,null,null,null,null,null,null,null,null,null,null,null,null,null,null,null,null,null,null,null,null,null,null,null,null,null,null,null,null,null,null,null,null,null,null,null,null,null,null,null,null,null,null,null,null,null,null,null,null,null,null,null,null,null,"2015-02-28"]
["Principal (Foreign Shipping Line) Code",null,null,{"$f":"IF(C4=\"\",look(codes!$D$1:$G$5029,Template!D2,2,Template!B5,3,4),C4)","v":{"$error":"#NAME?"}},null,null,null,null,null,null,null,null,null,null,null,null,null,null,null,null,null,null,null,null,null,null,null,null,null,null,null,null,null,null,null,null,null,null,null,null,null,null,null,null,null,null,null,null,null,null,null,null,null,null,null,null,null,null,null,null,null,null,"2015-03-31"]
["Name of Principal (Foreign Shipping Line)","","   ",{"$f":"look(codes!$D$2:$G$5029,Template!D2,2,Template!D4,4,3)","v":{"$error":"#NAME?"}},null,null,null,null,null,null,null,null,null,null,null,null,null,null,null,null,null,null,null,null,null,null,null,null,null,null,null,null,null,null,null,null,null,null,null,null,null,null,null,null,null,null,null,null,null,null,null,null,null,null,null,null,null,null,null,null,null,null,"2015-04-30"]
["Country Code",null,null,{"$f":"IF(C6=\"\",VLOOKUP(B7,codes!$A$1:$B$305,2,FALSE),C6)","v":{"$error":"#N/A"}},null,null,null,null,null,null,null,null,null,null,null,null,null,null,null,null,null,null,null,null,null,null,null,null,null,null,null,null,null,null,null,null,null,null,null,null,null,null,null,null,null,null,null,null,null,null,null,null,null,null,null,null,null,null,null,null,null,null,"2015-05-31"]
["Country","","   ",{"$f":"INDEX(codes!A:A,MATCH(Template!D6,codes!B:B,0))","v":{"$error":"#N/A"}},null,null,null,null,null,null,null,null,null,null,null,null,null,null,null,null,null,null,null,null,null,null,null,null,null,null,null,null,null,null,null,null,null,null,null,null,null,null,null,null,null,null,null,null,null,null,null,null,null,null,null,null,null,null,null,null,null,null,"2015-06-30"]
["Period (dd-Mon-yyyy)",null,"2015-01-31",{"$f":"C8","v":"2015-01-31"},null,null,null,null,null,null,null,null,null,null,null,null,null,null,null,null,null,null,null,null,null,null,null,null,null,null,null,null,null,null,null,null,null,null,null,null,null,null,null,null,null,null,null,null,null,null,null,null,null,null,null,null,null,null,null,null,null,null,"2015-07-31"]
[null,null,null,null,null,null,null,null,null,null,null,null,null,null,null,null,null,null,null,null,null,null,null,null,null,null,null,null,null,null,null,null,null,null,null,null,null,null,null,null,null,null,null,null,null,null,null,null,null,null,null,null,null,null,null,null,null,null,null,null,null,null,"2015-08-31"]
["Description","Code","Amount in PKR",null,null,null,null,null,null,null,null,null,null,null,null,null,null,null,null,null,null,null,null,null,null,null,null,null,null,null,null,null,null,null,null,null,null,null,null,null,null,null,null,null,null,null,null,null,null,null,null,null,null,null,null,null,null,null,null,null,null,null,"2015-09-30"]
["No. of vessels handled during the month",20101,null,null,null,null,null,null,null,null,null,null,null,null,null,null,null,null,null,null,null,null,null,null,null,null,null,null,null,null,null,null,null,null,null,null,null,null,null,null,null,null,null,null,null,null,null,null,null,null,null,null,null,null,null,null,null,null,null,null,null,null,"2015-10-31"]
["1. Opening Balance - Credit",20102,0,null,null,null,null,null,null,null,null,null,null,null,null,null,null,null,null,null,null,null,null,null,null,null,null,null,null,null,null,null,null,null,null,null,null,null,null,null,null,null,null,null,null,null,null,null,null,null,null,null,null,null,null,null,null,null,null,null,null,null,"2015-11-30"]
["1. Opening Balance - Debit",20103,0,null,null,null,null,null,null,null,null,null,null,null,null,null,null,null,null,null,null,null,null,null,null,null,null,null,null,null,null,null,null,null,null,null,null,null,null,null,null,null,null,null,null,null,null,null,null,null,null,null,null,null,null,null,null,null,null,null,null,null,"2015-12-31"]
["Earnings/Receipts",null,null,null,null,null,null,null,null,null,null,null,null,null,null,null,null,null,null,null,null,null,null,null,null,null,null,null,null,null,null,null,null,null,null,null,null,null,null,null,null,null,null,null,null,null,null,null,null,null,null,null,null,null,null,null,null,null,null,null,null,null,"2016-01-31"]
["2. Freight Collection",20125,{"$f":"C16+C17+C18","v":0},null,null,null,null,null,null,null,null,null,null,null,null,null,null,null,null,null,null,null,null,null,null,null,null,null,null,null,null,null,null,null,null,null,null,null,null,null,null,null,null,null,null,null,null,null,null,null,null,null,null,null,null,null,null,null,null,null,null,null,"2016-02-29"]
["2.1. Freight on exports",20104,null,null,null,null,null,null,null,null,null,null,null,null,null,null,null,null,null,null,null,null,null,null,null,null,null,null,null,null,null,null,null,null,null,null,null,null,null,null,null,null,null,null,null,null,null,null,null,null,null,null,null,null,null,null,null,null,null,null,null,null,"2016-03-31"]
["2.2. Freight on imports",20105,null,null,null,null,null,null,null,null,null,null,null,null,null,null,null,null,null,null,null,null,null,null,null,null,null,null,null,null,null,null,null,null,null,null,null,null,null,null,null,null,null,null,null,null,null,null,null,null,null,null,null,null,null,null,null,null,null,null,null,null,"2016-04-30"]
["2.3. Mail or Courier Services to non-residents ",20124,null,null,null,null,null,null,null,null,null,null,null,null,null,null,null,null,null,null,null,null,null,null,null,null,null,null,null,null,null,null,null,null,null,null,null,null,null,null,null,null,null,null,null,null,null,null,null,null,null,null,null,null,null,null,null,null,null,null,null,null,"2016-05-31"]
["3. Charter of ships/vessels with crew to Pakistan ",20126,null,null,null,null,null,null,null,null,null,null,null,null,null,null,null,null,null,null,null,null,null,null,null,null,null,null,null,null,null,null,null,null,null,null,null,null,null,null,null,null,null,null,null,null,null,null,null,null,null,null,null,null,null,null,null,null,null,null,null,null,"2016-06-30"]
["4. Charter of ships/vessels without crew to Pakistan ",20127,null,null,null,null,null,null,null,null,null,null,null,null,null,null,null,null,null,null,null,null,null,null,null,null,null,null,null,null,null,null,null,null,null,null,null,null,null,null,null,null,null,null,null,null,null,null,null,null,null,null,null,null,null,null,null,null,null,null,null,null,"2016-07-31"]
{"$rows_left_out":174}
{"sheet":"Definitions","index":2,"n_rows":38,"n_cols":3,"rows_kept":38,"cut":false,"hidden":false,"merged":[[0,1,0,2]]}
["No.","Description of Items-Foreign Shipping Company"]
[null,"Name of Principal (Shipping Agents )","Name of the foreign shipping line on whose behalf all the earnings and expenses are made"]
[null,"Country","Country of origin of the foreign shipping line."]
[null,"No. of Vessels handled during the Month ","Number of vessels handled of the particular shipping line during the month "]
[2.1,"Freight on exports","Freight on exports earned from exporters by the foreign shipping line during the month "]
[2.2000000000000002,"Freight on imports","Freight earnings from importers by foreign shipping line during the month"]
[2.2999999999999998,"Mail or Courier Services to non-residents ","Earnings from residents of Pakistan on account of mail or courier services charges for pick-up, transport and delivery of letters, newspapers, periodicals, brochures and other printed matter and of parcels, packages"]
["3  ","Charter of ships/vessels with crew to Pakistan ","Earnings on charter of ships (vessels) with crew to Pakistan"]
["4 ","Charter of ships/vessels without crew  to Pakistan ","Earnings on charter of ships (vessels) without crew to Pakistan for a limited period i.e. time charter. Charter of ships without crew fall under operational leasing (rental) services."]
["5  ","Inward  remittances","Foreign exchange received from foreign shipping line through Authorized Dealers to cover the additional expenses paid by the shipping agent"]
["6   ","Other earnings (please specify)","Any other earnings not specified elsewhere and services provided during the month"]
[8,"Fuel purchased ","Expenses made for purchase of bunker oil to the ships during the month by the agent on behalf of shipping line excluding all other expensess for provisions (caterings and other supplies on board, etc) to the ship in Pakistan"]
[9,"Catering and other supplies on board","Expenses for caterings and other supplies on board in Pakistan during the month to the ships by the agent on behalf of foreign shipping line "]
["10 ","Repair of ships","Expenses for repairs of the ships carried out during stay on Pakistani ports during the month"]
["11 ","Crew expenses during transit stay in Pakistan (hotel bill, transport, etc.)","Expenses made for the crew during transit stay"]
["12 ","Agency commission","Expenses made by the foreign shipping line for agency commission"]
[13,"Office expenses","Expenses made by the foreign shipping line for office expenses"]
["14 ","Landing/ handling charges/port charges ","Expenses made by the foreign shipping line for landing/ handling charges/port charges"]
[15,"Entertainment & advertisement ","Expenses made by the foreign shipping line for entertainment & advertisement"]
["16 ","Charter of ship with crew for freight","Expenses on account of charter of ships (vessels) with crew."]
{"$rows_left_out":19}
{"sheet":"From File","index":3,"n_rows":143,"n_cols":4,"rows_kept":143,"cut":false,"hidden":true,"merged":[]}
[null," "]
[]
[]
["Message Type","Message"]
["Information","Seatrade 2.csv: 418 Records Found"]
["Information","Seatrade 2.csv: Following Source Group - Sources found 163-17 163-18 163-23 163-20 163-22 163-26 163-27 163-35 163-36 163-61 163-4 163-65 163-71 163-30 163-87 163-82 163-89 163-90 163-91"]
["Information","163-17: Copying Records Source Group=163 and Source=17"]
["Information","163-17: Pasting"]
["Information","163-17: Checking Errors"]
["Information","163-17: Opening = Closing of Last month"]
["Information","163-17: Closing = Opening + Receipts - Payments"]
["Information","163-17: Adding records to database"]
["Information","163-17: Records are successfully added to database sheet"]
["Information","163-18: Copying Records Source Group=163 and Source=18"]
["Information","163-18: Pasting"]
["Information","163-18: Checking Errors"]
["Information","163-18: Opening = Closing of Last month",null," "]
["Information","163-18: Closing = Opening + Receipts - Payments"]
["Information","163-18: Adding records to database"]
["Information","163-18: Records are successfully added to database sheet"]
{"$rows_left_out":124}
{"sheet":"database","index":4,"n_rows":1,"n_cols":12,"rows_kept":1,"cut":false,"hidden":false,"merged":[]}
["Sector ","Batch No.","S. No.","Source Group","Source","CountryCodes","Currency","Group","Description","Period (dd-Mon-yyyy)","Amount","Department"]

{"sheet":"codes","index":5,"n_rows":3370,"n_cols":7,"rows_kept":3370,"cut":false,"hidden":true,"merged":[]}
["Country","Code",null,"Name of Foreign Shipping Company/ Agent","Foreign Shipping Company/ Agent Code","Name of Principal (Foreign Shipping Line)","Principal (Foreign Shipping Line) Code"]
["Afghanistan ",10,395,"A.A Enterprises (Reg. No. SA-545)",395,"No Principal available",0]
["Albania ",20,368,"A.K Shipping & Logistics (Reg. No. SA-500)",368,"No Principal available",0]
["Algeria ",30,175,"Aaras Shipping Agencies (Pvt.) Ltd. ",175,"Da-Desk",8]
["American Samoa ",40,175,"Aaras Shipping Agencies (Pvt.) Ltd. ",175,"Elmira Shipping & Trading SA",14]
["Andorra ",50,175,"Aaras Shipping Agencies (Pvt.) Ltd. ",175,"Erika Shipping Pte Ltd",15]
["Angola ",60,175,"Aaras Shipping Agencies (Pvt.) Ltd. ",175,"Go Prosper International Ltd.",5]
["Antigua & Barbuda ",70,175,"Aaras Shipping Agencies (Pvt.) Ltd. ",175,"Hanssy Shipping Pte Ltd.",3]
["Argentina ",80,175,"Aaras Shipping Agencies (Pvt.) Ltd. ",175,"Hong Glory Shipping Co., Ltd",6]
["Armenia ",85,175,"Aaras Shipping Agencies (Pvt.) Ltd. ",175,"Hong Ocean Shipping Co Ltd",7]
["Aruba (Kingdom Of Netherlands) ",87,175,"Aaras Shipping Agencies (Pvt.) Ltd. ",175,"Hong Union Shipping Ltd.",2]
["Australia ",90,175,"Aaras Shipping Agencies (Pvt.) Ltd. ",175,"King Ship (HK) Ltd",9]
["Austria ",100,175,"Aaras Shipping Agencies (Pvt.) Ltd. ",175,"Nanjing Ocean Shipping Co. Ltd.",4]
["Azerbaijan ",105,175,"Aaras Shipping Agencies (Pvt.) Ltd. ",175,"Naspacific Shipping Co. Ltd",13]
["Bahamas ",110,175,"Aaras Shipping Agencies (Pvt.) Ltd. ",175,"Navalmar UK Ltd",12]
["Bahrain ",120,175,"Aaras Shipping Agencies (Pvt.) Ltd. ",175,"Pacific Bulk Lines Co Ltd",10]
["Bangladesh ",130,175,"Aaras Shipping Agencies (Pvt.) Ltd. ",175,"Source King Holdings Ltd",11]
["Barbados ",140,175,"Aaras Shipping Agencies (Pvt.) Ltd. ",175,"Varamar Ltd.",1]
["Belgium ",150,234,"Aat Multimodal Logistics Company (Reg. No. SA-666)",234,"No Principal available",0]
["Belarus ",155,269,"Abdul Aziz Saval & Co (Reg. No. SA-714)",269,"No Principal available",0]
{"$rows_left_out":3351}
{"sheet":"dbf","index":6,"n_rows":47,"n_cols":12,"rows_kept":47,"cut":false,"hidden":false,"merged":[]}
["Sector ","Batch No.","S. No.","Source Group","Source","CountryCodes","Currency","Group","Description","Period (dd-Mon-yyyy)","Amount","Department"]
[2,null,1,{"$f":"Template!$D$2","v":{"$error":"#N/A"}},{"$f":"Template!$D$4","v":{"$error":"#NAME?"}},{"$f":"Template!$D$6","v":{"$error":"#N/A"}},19,201,{"$f":"Template!B11","v":20101},{"$f":"Template!$D$8","v":"2015-01-31"},{"$f":"Template!C11","v":0},0]
[2,null,2,{"$f":"Template!$D$2","v":{"$error":"#N/A"}},{"$f":"Template!$D$4","v":{"$error":"#NAME?"}},{"$f":"Template!$D$6","v":{"$error":"#N/A"}},19,201,{"$f":"Template!B12","v":20102},{"$f":"Template!$D$8","v":"2015-01-31"},{"$f":"Template!C12","v":0},0]
[2,null,3,{"$f":"Template!$D$2","v":{"$error":"#N/A"}},{"$f":"Template!$D$4","v":{"$error":"#NAME?"}},{"$f":"Template!$D$6","v":{"$error":"#N/A"}},19,201,{"$f":"Template!B13","v":20103},{"$f":"Template!$D$8","v":"2015-01-31"},{"$f":"Template!C13","v":0},0]
[2,null,4,{"$f":"Template!$D$2","v":{"$error":"#N/A"}},{"$f":"Template!$D$4","v":{"$error":"#NAME?"}},{"$f":"Template!$D$6","v":{"$error":"#N/A"}},19,201,{"$f":"Template!B15","v":20125},{"$f":"Template!$D$8","v":"2015-01-31"},{"$f":"Template!C15","v":0},0]
[2,null,5,{"$f":"Template!$D$2","v":{"$error":"#N/A"}},{"$f":"Template!$D$4","v":{"$error":"#NAME?"}},{"$f":"Template!$D$6","v":{"$error":"#N/A"}},19,201,{"$f":"Template!B16","v":20104},{"$f":"Template!$D$8","v":"2015-01-31"},{"$f":"Template!C16","v":0},0]
[2,null,6,{"$f":"Template!$D$2","v":{"$error":"#N/A"}},{"$f":"Template!$D$4","v":{"$error":"#NAME?"}},{"$f":"Template!$D$6","v":{"$error":"#N/A"}},19,201,{"$f":"Template!B17","v":20105},{"$f":"Template!$D$8","v":"2015-01-31"},{"$f":"Template!C17","v":0},0]
[2,null,7,{"$f":"Template!$D$2","v":{"$error":"#N/A"}},{"$f":"Template!$D$4","v":{"$error":"#NAME?"}},{"$f":"Template!$D$6","v":{"$error":"#N/A"}},19,201,{"$f":"Template!B18","v":20124},{"$f":"Template!$D$8","v":"2015-01-31"},{"$f":"Template!C18","v":0},0]
[2,null,8,{"$f":"Template!$D$2","v":{"$error":"#N/A"}},{"$f":"Template!$D$4","v":{"$error":"#NAME?"}},{"$f":"Template!$D$6","v":{"$error":"#N/A"}},19,201,{"$f":"Template!B19","v":20126},{"$f":"Template!$D$8","v":"2015-01-31"},{"$f":"Template!C19","v":0},0]
[2,null,9,{"$f":"Template!$D$2","v":{"$error":"#N/A"}},{"$f":"Template!$D$4","v":{"$error":"#NAME?"}},{"$f":"Template!$D$6","v":{"$error":"#N/A"}},19,201,{"$f":"Template!B20","v":20127},{"$f":"Template!$D$8","v":"2015-01-31"},{"$f":"Template!C20","v":0},0]
[2,null,10,{"$f":"Template!$D$2","v":{"$error":"#N/A"}},{"$f":"Template!$D$4","v":{"$error":"#NAME?"}},{"$f":"Template!$D$6","v":{"$error":"#N/A"}},19,201,{"$f":"Template!B21","v":20106},{"$f":"Template!$D$8","v":"2015-01-31"},{"$f":"Template!C21","v":0},0]
[2,null,11,{"$f":"Template!$D$2","v":{"$error":"#N/A"}},{"$f":"Template!$D$4","v":{"$error":"#NAME?"}},{"$f":"Template!$D$6","v":{"$error":"#N/A"}},19,201,{"$f":"Template!B22","v":20107},{"$f":"Template!$D$8","v":"2015-01-31"},{"$f":"Template!C22","v":0},0]
[2,null,12,{"$f":"Template!$D$2","v":{"$error":"#N/A"}},{"$f":"Template!$D$4","v":{"$error":"#NAME?"}},{"$f":"Template!$D$6","v":{"$error":"#N/A"}},19,201,{"$f":"Template!B23","v":20108},{"$f":"Template!$D$8","v":"2015-01-31"},{"$f":"Template!C23","v":0},0]
[2,null,13,{"$f":"Template!$D$2","v":{"$error":"#N/A"}},{"$f":"Template!$D$4","v":{"$error":"#NAME?"}},{"$f":"Template!$D$6","v":{"$error":"#N/A"}},19,201,{"$f":"Template!B25","v":20110},{"$f":"Template!$D$8","v":"2015-01-31"},{"$f":"Template!C25","v":0},0]
[2,null,14,{"$f":"Template!$D$2","v":{"$error":"#N/A"}},{"$f":"Template!$D$4","v":{"$error":"#NAME?"}},{"$f":"Template!$D$6","v":{"$error":"#N/A"}},19,201,{"$f":"Template!B26","v":20128},{"$f":"Template!$D$8","v":"2015-01-31"},{"$f":"Template!C26","v":0},0]
[2,null,15,{"$f":"Template!$D$2","v":{"$error":"#N/A"}},{"$f":"Template!$D$4","v":{"$error":"#NAME?"}},{"$f":"Template!$D$6","v":{"$error":"#N/A"}},19,201,{"$f":"Template!B27","v":20111},{"$f":"Template!$D$8","v":"2015-01-31"},{"$f":"Template!C27","v":0},0]
[2,null,16,{"$f":"Template!$D$2","v":{"$error":"#N/A"}},{"$f":"Template!$D$4","v":{"$error":"#NAME?"}},{"$f":"Template!$D$6","v":{"$error":"#N/A"}},19,201,{"$f":"Template!B28","v":20113},{"$f":"Template!$D$8","v":"2015-01-31"},{"$f":"Template!C28","v":0},0]
[2,null,17,{"$f":"Template!$D$2","v":{"$error":"#N/A"}},{"$f":"Template!$D$4","v":{"$error":"#NAME?"}},{"$f":"Template!$D$6","v":{"$error":"#N/A"}},19,201,{"$f":"Template!B29","v":20112},{"$f":"Template!$D$8","v":"2015-01-31"},{"$f":"Template!C29","v":0},0]
[2,null,18,{"$f":"Template!$D$2","v":{"$error":"#N/A"}},{"$f":"Template!$D$4","v":{"$error":"#NAME?"}},{"$f":"Template!$D$6","v":{"$error":"#N/A"}},19,201,{"$f":"Template!B30","v":20129},{"$f":"Template!$D$8","v":"2015-01-31"},{"$f":"Template!C30","v":0},0]
[2,null,19,{"$f":"Template!$D$2","v":{"$error":"#N/A"}},{"$f":"Template!$D$4","v":{"$error":"#NAME?"}},{"$f":"Template!$D$6","v":{"$error":"#N/A"}},19,201,{"$f":"Template!B31","v":20130},{"$f":"Template!$D$8","v":"2015-01-31"},{"$f":"Template!C31","v":0},0]
{"$rows_left_out":28}
{"sheet":"1304","index":7,"n_rows":1,"n_cols":12,"rows_kept":1,"cut":false,"hidden":true,"merged":[[5302,12,5323,12]]}
["Sector ","Batch No.","S. No.","Source Group","Source","CountryCodes","Currency","Group","Description","Period (dd-Mon-yyyy)","Amount","Department"]